{"text_format":"1","workbook":"xlsx","n_sheets":5,"sheets":["1. Flock Entry","2. Basic calculator","3. DDD DCD","4. Instructions","Sheet 5"],"not_rendered":{"charts":2,"images":5,"macros":1,"external_links":0,"defined_names":18,"comments":2,"pivot_tables":0},"unopened":[],"bounds":{"document_bytes":16777216,"sheet_cells":100000,"rows_first":2000,"rows_last":500,"rows_between":2000,"halvings":0,"cell_chars":16384,"cell_head_chars":4096},"cells_cut":0,"cells_raw":0,"read":"whole","date_system":"1900"}

{"sheet":"1. Flock Entry","index":0,"n_rows":16,"n_cols":2,"rows_kept":16,"cut":false,"hidden":false,"merged":[]}
[null,"Number"]
["Ewes on farm",100]
["Lambs (store or for breeding)",2]
["Lambs finished",1]
[]
[]
["Total kg",{"$f":"(A15*B2)+(A16*B3)+(B4*A16)","v":7560}]
[]
[]
[]
[]
[]
[]
["Weight (Kg)"]
[75]
[20]

{"sheet":"2. Basic calculator","index":1,"n_rows":57,"n_cols":10,"rows_kept":57,"cut":false,"hidden":false,"merged":[]}
[null,null,null,null,"TOTAL","Critical"]
[null,null,"Total mg/kg",null,{"$f":"(SUM(E7:E57))","v":1.984126984126984E-2},{"$f":"SUM(J30:J35)","v":0}]
[null,null,"Total DDD",null,{"$f":"'3. DDD DCD'!H8","v":2.3905144387072093E-3},{"$f":"'3. DDD DCD'!I8","v":0}]
[null,null,"Total DCD",null,{"$f":"'3. DDD DCD'!J8","v":6.8418171866447728E-4},{"$f":"'3. DDD DCD'!K8","v":0}]
[]
["Route","Product","Amount used","Units","mg/kg","Critically important?"]
["Injectable","Clamoxyl Ready-to-Use 150 mg/ml suspension for injection",1,{"$f":"IF(B7=\"\",\"\",VLOOKUP(B7,All,9,FALSE))","v":"ml"},{"$f":"IF(B7=\"\",\"\",(C7*(VLOOKUP(B7,All,8,FALSE))/('1. Flock Entry'!$B$7)))","v":1.984126984126984E-2},{"$f":"IF(B7=\"\",\"\",IF((VLOOKUP(B7,All,7,FALSE)>0),\"CRITICAL\",\"\"))","v":""}]
[null,null,null,"",{"$f":"IF(B8=\"\",\"\",(C8*(VLOOKUP(B8,All,8,FALSE))/('1. Flock Entry'!$B$7)))","v":""},{"$f":"IF(B8=\"\",\"\",IF((VLOOKUP(B8,All,7,FALSE)>0),\"CRITICAL\",\"\"))","v":""}]
[null,null,null,{"$f":"IF(B9=\"\",\"\",VLOOKUP(B9,All,9,FALSE))","v":""},{"$f":"IF(B9=\"\",\"\",(C9*(VLOOKUP(B9,All,8,FALSE))/('1. Flock Entry'!$B$7)))","v":""},{"$f":"IF(B9=\"\",\"\",IF((VLOOKUP(B9,All,7,FALSE)>0),\"CRITICAL\",\"\"))","v":""}]
[null,null,null,"",{"$f":"IF(B10=\"\",\"\",(C10*(VLOOKUP(B10,All,8,FALSE))/('1. Flock Entry'!$B$7)))","v":""},""]
[null,null,null,"",{"$f":"IF(B11=\"\",\"\",(C11*(VLOOKUP(B11,All,8,FALSE))/('1. Flock Entry'!$B$7)))","v":""},""]
[null,null,null,"",{"$f":"IF(B12=\"\",\"\",(C12*(VLOOKUP(B12,All,8,FALSE))/('1. Flock Entry'!$B$7)))","v":""},""]
[null,null,null,"",{"$f":"IF(B13=\"\",\"\",(C13*(VLOOKUP(B13,All,8,FALSE))/('1. Flock Entry'!$B$7)))","v":""},""]
[null,null,null,"",{"$f":"IF(B14=\"\",\"\",(C14*(VLOOKUP(B14,All,8,FALSE))/('1. Flock Entry'!$B$7)))","v":""},""]
[null,null,null,"",{"$f":"IF(B15=\"\",\"\",(C15*(VLOOKUP(B15,All,8,FALSE))/('1. Flock Entry'!$B$7)))","v":""},""]
[null,null,null,"",{"$f":"IF(B16=\"\",\"\",(C16*(VLOOKUP(B16,All,8,FALSE))/('1. Flock Entry'!$B$7)))","v":""},""]
[null,null,null,"",{"$f":"IF(B17=\"\",\"\",(C17*(VLOOKUP(B17,All,8,FALSE))/('1. Flock Entry'!$B$7)))","v":""},""]
[null,null,null,"",{"$f":"IF(B18=\"\",\"\",(C18*(VLOOKUP(B18,All,8,FALSE))/('1. Flock Entry'!$B$7)))","v":""},""]
[null,null,null,"",{"$f":"IF(B19=\"\",\"\",(C19*(VLOOKUP(B19,All,8,FALSE))/('1. Flock Entry'!$B$7)))","v":""},""]
[null,null,null,"",{"$f":"IF(B20=\"\",\"\",(C20*(VLOOKUP(B20,All,8,FALSE))/('1. Flock Entry'!$B$7)))","v":""},""]
{"$rows_left_out":38}
{"sheet":"3. DDD DCD","index":2,"n_rows":84,"n_cols":19,"rows_kept":84,"cut":false,"hidden":false,"merged":[[7,4,7,6],[5,4,5,6],[4,4,4,6],[3,4,3,6],[9,6,9,8],[6,4,6,6],[28,1,28,2],[27,1,27,2],[26,1,26,2],[11,6,11,8],[10,6,10,8],[34,1,34,2],[35,1,35,2],[36,1,36,2],[13,1,13,2],[14,1,14,2],[21,1,21,2],[20,1,20,2],[19,1,19,2],[18,1,18,2],[17,1,17,2],[16,1,16,2],[15,1,15,2],[25,1,25,2],[24,1,24,2],[23,1,23,2],[22,1,22,2],[29,1,29,2],[30,1,30,2],[31,1,31,2],[32,1,32,2],[33,1,33,2],[60,1,60,2],[49,1,49,2],[50,1,50,2],[51,1,51,2],[52,1,52,2],[53,1,53,2],[54,1,54,2],[55,1,55,2],[56,1,56,2],[57,1,57,2],[58,1,58,2],[59,1,59,2],[61,1,61,2],[62,1,62,2],[63,1,63,2],[64,1,64,2],[37,1,37,2],[38,1,38,2],[39,1,39,2],[40,1,40,2],[41,1,41,2],[42,1,42,2],[43,1,43,2],[44,1,44,2],[45,1,45,2],[46,1,46,2],[47,1,47,2],[48,1,48,2]]}
[null,null,null,null,null,null,null,"DDD","DDDcritical","DCD","DCDcritical"]
[null,null,null,null,"Injectable per kg",null,null,{"$f":"C71","v":2.3905144387072093E-3},{"$f":"E71","v":0},{"$f":"G71","v":6.8418171866447728E-4},{"$f":"I71","v":0}]
[null,null,null,null,"Oral per kg",null,null,{"$f":"D72","v":0},{"$f":"E72","v":0},{"$f":"H72","v":0},0]
[null,null,null,null,"Topical per ewe",null,null,"NA","NA",{"$f":"H73","v":0},0]
[null,null,null,null,"Footbath per ewe",null,null,{"$f":"D74","v":0},{"$f":"E74","v":0},{"$f":"H74","v":0},0]
[null,null,null,null,"Eye treatment per ewe",null,null,{"$f":"C75","v":0},{"$f":"E75","v":0},{"$f":"G75","v":0},0]
[null,null,null,null,"Intramammary per ewe",null,null,{"$f":"C76","v":0},{"$f":"E76","v":0},{"$f":"G76","v":0},0]
[null,null,null,null,"TOTAL",null,null,{"$f":"H2+H3+H6+H5+H7","v":2.3905144387072093E-3},{"$f":"SUM(I2:I3,I5:I7)","v":0},{"$f":"SUM(J2:J7)","v":6.8418171866447728E-4},{"$f":"SUM(K2:K7)","v":0}]
[]
[null,null,null,null,null,null,null,null,null,"Total","Critical"]
[null,null,null,null,null,null,"Total mg/kg in flock",null,null,{"$f":"(SUM(G15:G65))","v":1.984126984126984E-2},{"$f":"SUM(D79:D84)","v":0}]
[null,null,null,null,null,null,"Total DDD",null,null,{"$f":"H8","v":2.3905144387072093E-3},{"$f":"I8","v":0}]
[]
["Route","Product",null,"Amount used","Units","mg","mg/kg","DDDvet","DCDvet","Per","Critically important?",null,null,null,null,null,"DDDvet","DCDvet","per"]
[{"$f":"IF('2. Basic calculator'!A7=\"\",\"\",'2. Basic calculator'!A7)","v":"Injectable"},{"$f":"IF('2. Basic calculator'!B7=\"\",\"\",'2. Basic calculator'!B7)","v":"Clamoxyl Ready-to-Use 150 mg/ml suspension for injection"},null,{"$f":"IF('2. Basic calculator'!C7=\"\",\"\",'2. Basic calculator'!C7)","v":1},{"$f":"IF('2. Basic calculator'!D7=\"\",\"\",'2. Basic calculator'!D7)","v":"ml"},{"$f":"IF(B15=\"\",\"\",D15*VLOOKUP(B15,All,8,FALSE))","v":150},{"$f":"IF('2. Basic calculator'!E7=\"\",\"\",'2. Basic calculator'!E7)","v":1.984126984126984E-2},{"$f":"IF(A15=\"\",\"\",IF(A15=\"Footbath\",F15/Q15/Herdentry2,IF(E15=\"Tubes\",D15/Q15/Herdentry2,IF(E15=\"Units\",F15/Q15/Herdentry2,'3. DDD DCD'!G15/'3. DDD DCD'!Q15))))","v":2.3905144387072093E-3},{"$f":"IF(A15=\"\",\"\",IF(A15=\"Footbath\",F15/R15/Herdentry2,IF(E15=\"Tubes\",D15/R15/Herdentry2,IF(E15=\"Units\",F15/R15/Herdentry2,'3. DDD DCD'!G15/'3. DDD DCD'!R15))))","v":6.8418171866447728E-4},{"$f":"IF(A15=\"\",\"\",IF(A15=\"Footbath\",\"Ewe\",IF(S15=\"kg\",\"kg\",IF(A15=\"Topical\",\"Ewe\",IF(A15=\"EyeTreatment\",\"Ewe\",IF(E15=\"Tubes\",\"Ewe\",\" \"))))))","v":"kg"},{"$f":"IF(B15=\"\",\"\",IF((VLOOKUP(B15,All,7,FALSE)>0),\"CRITICAL\",\"\"))","v":""},null,null,null,null,null,{"$f":"IF(A15=\"\",\"\",VLOOKUP(B15,All,10,FALSE))","v":8.3000000000000007},{"$f":"IF(A15=\"\",\"\",VLOOKUP(B15,All,11,FALSE))","v":29},{"$f":"IF(E15=\"\",\"\",IF(E15=\"ml\",\"kg\",IF(E15=\"grams\",\"kg\",\"unit\")))","v":"kg"}]
[{"$f":"IF('2. Basic calculator'!A8=\"\",\"\",'2. Basic calculator'!A8)","v":""},{"$f":"IF('2. Basic calculator'!B8=\"\",\"\",'2. Basic calculator'!B8)","v":""},null,{"$f":"IF('2. Basic calculator'!C8=\"\",\"\",'2. Basic calculator'!C8)","v":""},{"$f":"IF('2. Basic calculator'!D8=\"\",\"\",'2. Basic calculator'!D8)","v":""},{"$f":"IF(B16=\"\",\"\",D16*VLOOKUP(B16,All,8,FALSE))","v":""},{"$f":"IF('2. Basic calculator'!E8=\"\",\"\",'2. Basic calculator'!E8)","v":""},{"$f":"IF(A16=\"\",\"\",IF(A16=\"Footbath\",F16/Q16/Herdentry2,IF(E16=\"Tubes\",D16/Q16/Herdentry2,IF(E16=\"Units\",F16/Q16/Herdentry2,'3. DDD DCD'!G16/'3. DDD DCD'!Q16))))","v":""},{"$f":"IF(A16=\"\",\"\",IF(A16=\"Footbath\",F16/R16/Herdentry2,IF(E16=\"Tubes\",D16/R16/Herdentry2,IF(E16=\"Units\",F16/R16/Herdentry2,'3. DDD DCD'!G16/'3. DDD DCD'!R16))))","v":""},{"$f":"IF(A16=\"\",\"\",IF(A16=\"Footbath\",\"Ewe\",IF(S16=\"kg\",\"kg\",IF(A16=\"Topical\",\"Ewe\",IF(A16=\"EyeTreatment\",\"Ewe\",IF(E16=\"Tubes\",\"Ewe\",\" \"))))))","v":""},"",null,null,null,null,null,"","",""]
[{"$f":"IF('2. Basic calculator'!A9=\"\",\"\",'2. Basic calculator'!A9)","v":""},{"$f":"IF('2. Basic calculator'!B9=\"\",\"\",'2. Basic calculator'!B9)","v":""},null,{"$f":"IF('2. Basic calculator'!C9=\"\",\"\",'2. Basic calculator'!C9)","v":""},{"$f":"IF('2. Basic calculator'!D9=\"\",\"\",'2. Basic calculator'!D9)","v":""},"",{"$f":"IF('2. Basic calculator'!E9=\"\",\"\",'2. Basic calculator'!E9)","v":""},{"$f":"IF(A17=\"\",\"\",IF(A17=\"Footbath\",F17/Q17/Herdentry2,IF(E17=\"Tubes\",D17/Q17/Herdentry2,IF(E17=\"Units\",F17/Q17/Herdentry2,'3. DDD DCD'!G17/'3. DDD DCD'!Q17))))","v":""},{"$f":"IF(A17=\"\",\"\",IF(A17=\"Footbath\",F17/R17/Herdentry2,IF(E17=\"Tubes\",D17/R17/Herdentry2,IF(E17=\"Units\",F17/R17/Herdentry2,'3. DDD DCD'!G17/'3. DDD DCD'!R17))))","v":""},"","",null,null,null,null,null,"","",{"$f":"IF(E17=\"\",\"\",IF(E17=\"ml\",\"kg\",IF(E17=\"grams\",\"kg\",\"unit\")))","v":""}]
[{"$f":"IF('2. Basic calculator'!A10=\"\",\"\",'2. Basic calculator'!A10)","v":""},{"$f":"IF('2. Basic calculator'!B10=\"\",\"\",'2. Basic calculator'!B10)","v":""},null,{"$f":"IF('2. Basic calculator'!C10=\"\",\"\",'2. Basic calculator'!C10)","v":""},{"$f":"IF('2. Basic calculator'!D10=\"\",\"\",'2. Basic calculator'!D10)","v":""},"",{"$f":"IF('2. Basic calculator'!E10=\"\",\"\",'2. Basic calculator'!E10)","v":""},{"$f":"IF(A18=\"\",\"\",IF(A18=\"Footbath\",F18/Q18/Herdentry2,IF(E18=\"Tubes\",D18/Q18/Herdentry2,IF(E18=\"Units\",F18/Q18/Herdentry2,'3. DDD DCD'!G18/'3. DDD DCD'!Q18))))","v":""},{"$f":"IF(A18=\"\",\"\",IF(A18=\"Footbath\",F18/R18/Herdentry2,IF(E18=\"Tubes\",D18/R18/Herdentry2,IF(E18=\"Units\",F18/R18/Herdentry2,'3. DDD DCD'!G18/'3. DDD DCD'!R18))))","v":""},"","",null,null,null,null,null,"","",""]
[{"$f":"IF('2. Basic calculator'!A11=\"\",\"\",'2. Basic calculator'!A11)","v":""},{"$f":"IF('2. Basic calculator'!B11=\"\",\"\",'2. Basic calculator'!B11)","v":""},null,{"$f":"IF('2. Basic calculator'!C11=\"\",\"\",'2. Basic calculator'!C11)","v":""},{"$f":"IF('2. Basic calculator'!D11=\"\",\"\",'2. Basic calculator'!D11)","v":""},{"$f":"IF(B19=\"\",\"\",D19*VLOOKUP(B19,All,8,FALSE))","v":""},{"$f":"IF('2. Basic calculator'!E11=\"\",\"\",'2. Basic calculator'!E11)","v":""},{"$f":"IF(A19=\"\",\"\",IF(A19=\"Footbath\",F19/Q19/Herdentry2,IF(E19=\"Tubes\",D19/Q19/Herdentry2,IF(E19=\"Units\",F19/Q19/Herdentry2,'3. DDD DCD'!G19/'3. DDD DCD'!Q19))))","v":""},{"$f":"IF(A19=\"\",\"\",IF(A19=\"Footbath\",F19/R19/Herdentry2,IF(E19=\"Tubes\",D19/R19/Herdentry2,IF(E19=\"Units\",F19/R19/Herdentry2,'3. DDD DCD'!G19/'3. DDD DCD'!R19))))","v":""},"","",null,null,null,null,null,"","",""]
[{"$f":"IF('2. Basic calculator'!A12=\"\",\"\",'2. Basic calculator'!A12)","v":""},{"$f":"IF('2. Basic calculator'!B12=\"\",\"\",'2. Basic calculator'!B12)","v":""},null,{"$f":"IF('2. Basic calculator'!C12=\"\",\"\",'2. Basic calculator'!C12)","v":""},{"$f":"IF('2. Basic calculator'!D12=\"\",\"\",'2. Basic calculator'!D12)","v":""},"",{"$f":"IF('2. Basic calculator'!E12=\"\",\"\",'2. Basic calculator'!E12)","v":""},{"$f":"IF(A20=\"\",\"\",IF(A20=\"Footbath\",F20/Q20/Herdentry2,IF(E20=\"Tubes\",D20/Q20/Herdentry2,IF(E20=\"Units\",F20/Q20/Herdentry2,'3. DDD DCD'!G20/'3. DDD DCD'!Q20))))","v":""},{"$f":"IF(A20=\"\",\"\",IF(A20=\"Footbath\",F20/R20/Herdentry2,IF(E20=\"Tubes\",D20/R20/Herdentry2,IF(E20=\"Units\",F20/R20/Herdentry2,'3. DDD DCD'!G20/'3. DDD DCD'!R20))))","v":""},"","",null,null,null,null,null,"","",""]
{"$rows_left_out":65}
{"sheet":"4. Instructions","index":3,"n_rows":39,"n_cols":3,"rows_kept":39,"cut":false,"hidden":false,"merged":[[11,0,11,1],[12,0,12,1]]}
["University of Nottingham Sheep Antimicrobial Use Calculator 3.5"]
["Disclaimer: Please note, use of this calculator is at the user's own risk "]
[]
["Instructions"]
["This calculator is designed to provide an estimation of antimicrobial usage on farms using Sheep Health and "]
["Welfare Group (SHAWG) core sheep antibiotic metrics. Further guidance is available here."]
["The calculator incorporates core sheep metrics with ESVAC methodology such as DDD and DCD. "]
["There are various caveats to each method, and these should be discussed with your veterinarian. "]
[]
["       Mg/kg describes the SHAWG core sheep metric and is calculated as follows: "]
[]
["Total mass antibiotic (mg)"]
["[20 x total numbers of lambs (finished+store)] + [75 x number of ewes] (kg)"]
[]
["       DDD describes the number of equivalent doses of antibiotic per animal or Kg on a farm"]
["       DCD describes the number of equivalent courses of an antibiotic per animal or Kg on a farm"]
["Enter farm details by clicking: "]
["Enter all antimicrobials used on the farm over a twelve month period"]
["Select a ROUTE, PRODUCT and AMOUNT of drug used by clicking: "]
["Amount used will be presented in mls, grams or units"]
{"$rows_left_out":20}
{"sheet":"Sheet 5","index":4,"n_rows":138,"n_cols":13,"rows_kept":138,"cut":false,"hidden":false,"merged":[]}
["Drug","Active","Route","Dose mg/kg (or mg/tube)","treatments (days/tubes)","Dose per Tx","Critical","mg/unit","Units","DDD","DCD",null,"Route"]
["Erythrocin 16.5 % w/w Soluble Powder for oral solution","Erythromycin","Footbath",165000,null,{"$f":"D2","v":165000},0,165,"grams",165,165,null,"Injectable"]
["Lincocin soluble powder for oral solution","Lincomycin","Footbath",60000,null,{"$f":"D3","v":60000},0,400,"grams",400,400,null,"Oral"]
["Linco-Spectin 100, 222/444.7 mg/g Powder for use in drinking water for pigs & chickens","Lincomycin","Footbath",64470.000000000007,1,{"$f":"D4","v":64470.000000000007},0,644.70000000000005,"grams",{"$f":"H4","v":644.70000000000005},{"$f":"H4","v":644.70000000000005},null,"Topical"]
["Tylan Soluble Powder for Oral Solution Footbath","Tylosin","Footbath",100000,1,{"$f":"D5","v":100000},0,1000,"grams",{"$f":"H5","v":1000},{"$f":"H5","v":1000},null,"Footbath"]
["Advocin 180 mg/ml Solution for Injection for Cattle","Danofloxacin Mesylate","Injectable",6,2,2550,1,180,"ml",1.9,5.0999999999999996,null,"EyeTreatment"]
["Advocin 2.5% Solution for Injection","Danofloxacin Mesylate","Injectable",1.25,3,531.25,1,25,"ml",1.9,5.0999999999999996,null,"Intramammary"]
["Alamycin 100mg/ml Solution for Injection","Oxytetracycline","Injectable",4,3,1700,0,100,"ml",6.5,23]
["Alamycin LA 200mg/ml Solution for Injection","Oxytetracycline","Injectable",20,1,8500,0,200,"ml",6.5,23]
["Alamycin LA 300 Solution for Injection 300mg/ml","Oxytetracycline","Injectable",20,1,8500,0,300,"ml",6.5,23]
["Amfipen LA 100 mg/ml suspension for injection","Ampicillin","Injectable",15,2,6375,0,100,"ml",8.3000000000000007,29]
["Amoxycare LA Suspension for Injection 15% w/v ","Amoxicillin","Injectable",15,null,null,0,150,"ml",8.3000000000000007,29]
["Amoxypen Injection 150 mg/ml Suspension for injection","Amoxicillin Trihydrate","Injectable",7,5,2975,0,150,"ml",8.3000000000000007,29]
["Amoxypen LA 150 mg/ml Suspension for injection","Amoxicillin Trihydrate","Injectable",15,2,6375,0,150,"ml",8.3000000000000007,29]
["Apotil 300 mg/ml Solution for Injection","Tilmicosin","Injectable",10,1,4250,0,300,"ml",4,9.8000000000000007]
["Baytril 100 mg/ml","Enrofloxacin","Injectable",5,5,2125,1,100,"ml",4.2,16]
["Baytril 50 mg/ml","Enrofloxacin","Injectable",5,5,2125,1,50,"ml",4.2,16]
["Baytril Max 100 mg/ml","Enrofloxacin","Injectable",7.5,1,3187.5,1,100,"ml",4.2,16]
["Betamox 150mg/ml Suspension for Injection","Amoxicillin","Injectable",7,5,2975,0,150,"ml",8.3000000000000007,29]
["Betamox LA 150mg/ml Suspension for Injection","Amoxicillin","Injectable",15,2,6375,0,150,"ml",8.3000000000000007,29]
{"$rows_left_out":118}